Last updated on 2026-10-31 04:51:33 CET.
| Flavor | Version | Tinstall | Tcheck | Ttotal | Status | Flags |
|---|---|---|---|---|---|---|
| r-devel-linux-x86_64-debian-clang | 2.0.0 | 13.86 | 846.51 | 860.37 | OK | |
| r-devel-linux-x86_64-debian-gcc | 2.0.0 | 9.61 | 856.42 | 866.03 | OK | |
| r-devel-linux-x86_64-fedora-clang | 2.0.0 | 421.25 | OK | |||
| r-devel-linux-x86_64-fedora-gcc | 2.0.0 | 10.00 | 573.18 | 583.18 | OK | |
| r-devel-windows-x86_64 | 2.0.0 | 15.00 | 280.00 | 295.00 | ERROR | |
| r-patched-linux-x86_64 | 2.0.0 | 15.41 | 954.72 | 970.13 | OK | |
| r-release-linux-x86_64 | 2.0.0 | 13.84 | 987.07 | 1000.91 | OK | |
| r-release-macos-arm64 | 2.0.0 | 3.00 | 148.00 | 151.00 | OK | |
| r-release-macos-x86_64 | 2.0.0 | 10.00 | 677.00 | 687.00 | OK | |
| r-release-windows-x86_64 | 2.0.0 | 14.00 | 277.00 | 291.00 | ERROR | |
| r-oldrel-macos-arm64 | 2.0.0 | 3.00 | 163.00 | 166.00 | OK | |
| r-oldrel-macos-x86_64 | 2.0.0 | 10.00 | 653.00 | 663.00 | OK | |
| r-oldrel-windows-x86_64 | 2.0.0 | 20.00 | 346.00 | 366.00 | ERROR |
Version: 2.0.0
Check: tests
Result: ERROR
Running 'testthat.R' [155s]
Running the tests in 'tests/testthat.R' failed.
Complete output:
> library(testthat)
> library(GMLTM)
> test_check("GMLTM")
specified C++17
make cmd is
make -f "D:/RCompile/recent/R/etc/x64/Makeconf" -f "D:/RCompile/recent/R/share/make/winshlib.mk" CXX='$(CXX17) $(CXX17STD)' CXXFLAGS='$(CXX17FLAGS)' CXXPICFLAGS='$(CXX17PICFLAGS)' SHLIB_LDFLAGS='$(SHLIB_CXX17LDFLAGS)' SHLIB_LD='$(SHLIB_CXX17LD)' SHLIB="file69598132148d3.dll" WIN=64 TCLBIN= OBJECTS="file69598132148d3.o"
make would use
make[1]: Entering directory '/d/temp/2026_10_25_01_50_00_21025/Rtmpkvmlg4'
g++ -std=gnu++17 -I"D:/RCompile/recent/R/include" -DNDEBUG -I"D:/RCompile/CRANpkg/lib/4.7/Rcpp/include/" -I"D:/temp/2026_10_25_01_50_00_21025/Rtmp2ppaRi/RLIBS_566843b795266/RcppEigen/include/" -I"D:/temp/2026_10_25_01_50_00_21025/Rtmp2ppaRi/RLIBS_566843b795266/RcppEigen/include/unsupported" -I"D:/temp/2026_10_25_01_50_00_21025/Rtmp2ppaRi/RLIBS_566843b795266/BH/include" -I"D:/RCompile/CRANpkg/lib/4.7/StanHeaders/include/src/" -I"D:/RCompile/CRANpkg/lib/4.7/StanHeaders/include/" -I"D:/RCompile/CRANpkg/lib/4.7/RcppParallel/include/" -DRCPP_PARALLEL_USE_TBB=1 -DTBB_INTERFACE_NEW -ID:/RCompile/CRANpkg/lib/4.7/RcppParallel/include -I"D:/RCompile/CRANpkg/lib/4.7/rstan/include" -DEIGEN_NO_DEBUG -DBOOST_DISABLE_ASSERTS -DBOOST_PENDING_INTEGER_LOG2_HPP -DSTAN_THREADS -DUSE_STANC3 -DSTRICT_R_HEADERS -DBOOST_PHOENIX_NO_VARIADIC_EXPRESSION -D_HAS_AUTO_PTR_ETC=0 -include "D:/RCompile/CRANpkg/lib/4.7/StanHeaders/include/stan/math/prim/fun/Eigen.hpp" -std=c++1y -I"d:/rtools45/x86_64-w64-mingw32.static.posix/include" -O2 -Wall -mfpmath=sse -msse2 -mstackrealign -c file69598132148d3.cpp -o file69598132148d3.o
if test "zfile69598132148d3.o" != "z"; then \
if test -e "file69598132148d3-win.def"; then \
echo g++ -shared -s -static-libgcc -o file69598132148d3.dll file69598132148d3-win.def file69598132148d3.o "D:/RCompile/CRANpkg/lib/4.7/rstan/lib/x64/libStanServices.a" -L"D:/RCompile/CRANpkg/lib/4.7/StanHeaders/libs/x64" -lStanHeaders -L"D:/RCompile/CRANpkg/lib/4.7/RcppParallel/lib/x64" -ltbb -LD:/RCompile/CRANpkg/lib/4.7/RcppParallel/libs/x64 -lRcppParallel -LD:/RCompile/CRANpkg/lib/4.7/RcppParallel/lib/x64 -ltbb -ltbbmalloc -L"d:/rtools45/x86_64-w64-mingw32.static.posix/lib/x64" -L"d:/rtools45/x86_64-w64-mingw32.static.posix/lib" -L"D:/RCompile/recent/R/bin/x64" -lR ; \
g++ -shared -s -static-libgcc -o file69598132148d3.dll file69598132148d3-win.def file69598132148d3.o "D:/RCompile/CRANpkg/lib/4.7/rstan/lib/x64/libStanServices.a" -L"D:/RCompile/CRANpkg/lib/4.7/StanHeaders/libs/x64" -lStanHeaders -L"D:/RCompile/CRANpkg/lib/4.7/RcppParallel/lib/x64" -ltbb -LD:/RCompile/CRANpkg/lib/4.7/RcppParallel/libs/x64 -lRcppParallel -LD:/RCompile/CRANpkg/lib/4.7/RcppParallel/lib/x64 -ltbb -ltbbmalloc -L"d:/rtools45/x86_64-w64-mingw32.static.posix/lib/x64" -L"d:/rtools45/x86_64-w64-mingw32.static.posix/lib" -L"D:/RCompile/recent/R/bin/x64" -lR ; \
else \
echo EXPORTS > tmp.def; \
nm file69598132148d3.o | sed -n 's/^.* [BCDRT] / /p' | sed -e '/[.]refptr[.]/d' -e '/[.]weak[.]/d' | sed 's/[^ ][^ ]*/"&"/g' >> tmp.def; \
echo g++ -shared -s -static-libgcc -o file69598132148d3.dll tmp.def file69598132148d3.o "D:/RCompile/CRANpkg/lib/4.7/rstan/lib/x64/libStanServices.a" -L"D:/RCompile/CRANpkg/lib/4.7/StanHeaders/libs/x64" -lStanHeaders -L"D:/RCompile/CRANpkg/lib/4.7/RcppParallel/lib/x64" -ltbb -LD:/RCompile/CRANpkg/lib/4.7/RcppParallel/libs/x64 -lRcppParallel -LD:/RCompile/CRANpkg/lib/4.7/RcppParallel/lib/x64 -ltbb -ltbbmalloc -L"d:/rtools45/x86_64-w64-mingw32.static.posix/lib/x64" -L"d:/rtools45/x86_64-w64-mingw32.static.posix/lib" -L"D:/RCompile/recent/R/bin/x64" -lR ; \
g++ -shared -s -static-libgcc -o file69598132148d3.dll tmp.def file69598132148d3.o "D:/RCompile/CRANpkg/lib/4.7/rstan/lib/x64/libStanServices.a" -L"D:/RCompile/CRANpkg/lib/4.7/StanHeaders/libs/x64" -lStanHeaders -L"D:/RCompile/CRANpkg/lib/4.7/RcppParallel/lib/x64" -ltbb -LD:/RCompile/CRANpkg/lib/4.7/RcppParallel/libs/x64 -lRcppParallel -LD:/RCompile/CRANpkg/lib/4.7/RcppParallel/lib/x64 -ltbb -ltbbmalloc -L"d:/rtools45/x86_64-w64-mingw32.static.posix/lib/x64" -L"d:/rtools45/x86_64-w64-mingw32.static.posix/lib" -L"D:/RCompile/recent/R/bin/x64" -lR ; \
rm -f tmp.def; \
fi \
fi
make[1]: Leaving directory '/d/temp/2026_10_25_01_50_00_21025/Rtmpkvmlg4'
Saving _problems/test-data-input-64.R
specified C++17
make cmd is
make -f "D:/RCompile/recent/R/etc/x64/Makeconf" -f "D:/RCompile/recent/R/share/make/winshlib.mk" CXX='$(CXX17) $(CXX17STD)' CXXFLAGS='$(CXX17FLAGS)' CXXPICFLAGS='$(CXX17PICFLAGS)' SHLIB_LDFLAGS='$(SHLIB_CXX17LDFLAGS)' SHLIB_LD='$(SHLIB_CXX17LD)' SHLIB="file69598509d6fd.dll" WIN=64 TCLBIN= OBJECTS="file69598509d6fd.o"
make would use
make[1]: Entering directory '/d/temp/2026_10_25_01_50_00_21025/Rtmpkvmlg4'
g++ -std=gnu++17 -I"D:/RCompile/recent/R/include" -DNDEBUG -I"D:/RCompile/CRANpkg/lib/4.7/Rcpp/include/" -I"D:/temp/2026_10_25_01_50_00_21025/Rtmp2ppaRi/RLIBS_566843b795266/RcppEigen/include/" -I"D:/temp/2026_10_25_01_50_00_21025/Rtmp2ppaRi/RLIBS_566843b795266/RcppEigen/include/unsupported" -I"D:/temp/2026_10_25_01_50_00_21025/Rtmp2ppaRi/RLIBS_566843b795266/BH/include" -I"D:/RCompile/CRANpkg/lib/4.7/StanHeaders/include/src/" -I"D:/RCompile/CRANpkg/lib/4.7/StanHeaders/include/" -I"D:/RCompile/CRANpkg/lib/4.7/RcppParallel/include/" -DRCPP_PARALLEL_USE_TBB=1 -DTBB_INTERFACE_NEW -ID:/RCompile/CRANpkg/lib/4.7/RcppParallel/include -I"D:/RCompile/CRANpkg/lib/4.7/rstan/include" -DEIGEN_NO_DEBUG -DBOOST_DISABLE_ASSERTS -DBOOST_PENDING_INTEGER_LOG2_HPP -DSTAN_THREADS -DUSE_STANC3 -DSTRICT_R_HEADERS -DBOOST_PHOENIX_NO_VARIADIC_EXPRESSION -D_HAS_AUTO_PTR_ETC=0 -include "D:/RCompile/CRANpkg/lib/4.7/StanHeaders/include/stan/math/prim/fun/Eigen.hpp" -std=c++1y -I"d:/rtools45/x86_64-w64-mingw32.static.posix/include" -O2 -Wall -mfpmath=sse -msse2 -mstackrealign -c file69598509d6fd.cpp -o file69598509d6fd.o
if test "zfile69598509d6fd.o" != "z"; then \
if test -e "file69598509d6fd-win.def"; then \
echo g++ -shared -s -static-libgcc -o file69598509d6fd.dll file69598509d6fd-win.def file69598509d6fd.o "D:/RCompile/CRANpkg/lib/4.7/rstan/lib/x64/libStanServices.a" -L"D:/RCompile/CRANpkg/lib/4.7/StanHeaders/libs/x64" -lStanHeaders -L"D:/RCompile/CRANpkg/lib/4.7/RcppParallel/lib/x64" -ltbb -LD:/RCompile/CRANpkg/lib/4.7/RcppParallel/libs/x64 -lRcppParallel -LD:/RCompile/CRANpkg/lib/4.7/RcppParallel/lib/x64 -ltbb -ltbbmalloc -L"d:/rtools45/x86_64-w64-mingw32.static.posix/lib/x64" -L"d:/rtools45/x86_64-w64-mingw32.static.posix/lib" -L"D:/RCompile/recent/R/bin/x64" -lR ; \
g++ -shared -s -static-libgcc -o file69598509d6fd.dll file69598509d6fd-win.def file69598509d6fd.o "D:/RCompile/CRANpkg/lib/4.7/rstan/lib/x64/libStanServices.a" -L"D:/RCompile/CRANpkg/lib/4.7/StanHeaders/libs/x64" -lStanHeaders -L"D:/RCompile/CRANpkg/lib/4.7/RcppParallel/lib/x64" -ltbb -LD:/RCompile/CRANpkg/lib/4.7/RcppParallel/libs/x64 -lRcppParallel -LD:/RCompile/CRANpkg/lib/4.7/RcppParallel/lib/x64 -ltbb -ltbbmalloc -L"d:/rtools45/x86_64-w64-mingw32.static.posix/lib/x64" -L"d:/rtools45/x86_64-w64-mingw32.static.posix/lib" -L"D:/RCompile/recent/R/bin/x64" -lR ; \
else \
echo EXPORTS > tmp.def; \
nm file69598509d6fd.o | sed -n 's/^.* [BCDRT] / /p' | sed -e '/[.]refptr[.]/d' -e '/[.]weak[.]/d' | sed 's/[^ ][^ ]*/"&"/g' >> tmp.def; \
echo g++ -shared -s -static-libgcc -o file69598509d6fd.dll tmp.def file69598509d6fd.o "D:/RCompile/CRANpkg/lib/4.7/rstan/lib/x64/libStanServices.a" -L"D:/RCompile/CRANpkg/lib/4.7/StanHeaders/libs/x64" -lStanHeaders -L"D:/RCompile/CRANpkg/lib/4.7/RcppParallel/lib/x64" -ltbb -LD:/RCompile/CRANpkg/lib/4.7/RcppParallel/libs/x64 -lRcppParallel -LD:/RCompile/CRANpkg/lib/4.7/RcppParallel/lib/x64 -ltbb -ltbbmalloc -L"d:/rtools45/x86_64-w64-mingw32.static.posix/lib/x64" -L"d:/rtools45/x86_64-w64-mingw32.static.posix/lib" -L"D:/RCompile/recent/R/bin/x64" -lR ; \
g++ -shared -s -static-libgcc -o file69598509d6fd.dll tmp.def file69598509d6fd.o "D:/RCompile/CRANpkg/lib/4.7/rstan/lib/x64/libStanServices.a" -L"D:/RCompile/CRANpkg/lib/4.7/StanHeaders/libs/x64" -lStanHeaders -L"D:/RCompile/CRANpkg/lib/4.7/RcppParallel/lib/x64" -ltbb -LD:/RCompile/CRANpkg/lib/4.7/RcppParallel/libs/x64 -lRcppParallel -LD:/RCompile/CRANpkg/lib/4.7/RcppParallel/lib/x64 -ltbb -ltbbmalloc -L"d:/rtools45/x86_64-w64-mingw32.static.posix/lib/x64" -L"d:/rtools45/x86_64-w64-mingw32.static.posix/lib" -L"D:/RCompile/recent/R/bin/x64" -lR ; \
rm -f tmp.def; \
fi \
fi
make[1]: Leaving directory '/d/temp/2026_10_25_01_50_00_21025/Rtmpkvmlg4'
Saving _problems/test-priors-50.R
[ FAIL 4 | WARN 0 | SKIP 0 | PASS 84 ]
══ Failed tests ════════════════════════════════════════════════════════════════
── Error ('test-data-input.R:60:3'): fitting with a plain matrix runs end to end without error (all four models) ──
Error in `compileCode(f, code, language = language, verbose = verbose)`: del = model695983c2ce2a__namespace::model695983c2ce2a_; BaseRNG = boost::random::additive_combine_engine<boost::random::linear_congruential_engine<unsigned int, 40014, 0, 2147483563>, boost::random::linear_congruential_engine<unsigned int, 40692, 0, 2147483399> >]'
22 | return 0.5 * z.p.transpose() * z.inv_e_metric_ * z.p;
D:/RCompile/CRANpkg/lib/4.7/StanHeaders/include/src/stan/mcmc/hmc/hamiltonians/dense_e_metric.hpp:21:0: required from here
21 | double T(dense_e_point& z) {
D:/RCompile/CRANpkg/lib/4.7/RcppEigen/include/Eigen/src/Core/DenseCoeffsBase.h:654:74: warning: ignoring attributes on template argument 'Eigen::internal::packet_traits<double>::type' {aka '__m128d'} [-Wignored-attributes]
654 | return internal::first_aligned<int(unpacket_traits<DefaultPacketType>::alignment),Derived>(m);
| ^~~~~~~~~
make[1]: *** [D:/RCompile/recent/R/etc/x64/Makeconf:304: file69598132148d3.o] Error 1
Backtrace:
▆
1. ├─testthat::expect_s3_class(...) at test-data-input.R:60:3
2. │ └─testthat::quasi_label(enquo(object))
3. │ └─rlang::eval_bare(expr, quo_get_env(quo))
4. ├─base::suppressWarnings(...)
5. │ └─base::withCallingHandlers(...)
6. └─GMLTM::GMLTM(...)
7. └─rstan::stan_model(stan_file)
8. └─rstan:::cxxfunctionplus(...)
9. ├─pkgbuild::with_build_tools(...)
10. │ └─pkgbuild:::withr_with_path(rtools_path(), code)
11. │ └─base::force(code)
12. └─inline::cxxfunction(...)
13. └─inline:::compileCode(f, code, language = language, verbose = verbose)
── Error ('test-data-input.R:60:3'): fitting with a plain matrix runs end to end without error (all four models) ──
Error in `sink(type = "output")`: invalid connection
Backtrace:
▆
1. ├─testthat::expect_s3_class(...) at test-data-input.R:60:3
2. │ └─testthat::quasi_label(enquo(object))
3. │ └─rlang::eval_bare(expr, quo_get_env(quo))
4. ├─base::suppressWarnings(...)
5. │ └─base::withCallingHandlers(...)
6. └─GMLTM::GMLTM(...)
7. └─rstan::stan_model(stan_file)
8. └─rstan:::cxxfunctionplus(...)
9. └─base::sink(type = "output")
── Error ('test-priors.R:46:3'): GMLTM fits successfully with priors$alpha$family = 'lognormal' ──
Error in `compileCode(f, code, language = language, verbose = verbose)`: el = model6959841e67331__namespace::model6959841e67331_; BaseRNG = boost::random::additive_combine_engine<boost::random::linear_congruential_engine<unsigned int, 40014, 0, 2147483563>, boost::random::linear_congruential_engine<unsigned int, 40692, 0, 2147483399> >]'
22 | return 0.5 * z.p.transpose() * z.inv_e_metric_ * z.p;
D:/RCompile/CRANpkg/lib/4.7/StanHeaders/include/src/stan/mcmc/hmc/hamiltonians/dense_e_metric.hpp:21:0: required from here
21 | double T(dense_e_point& z) {
D:/RCompile/CRANpkg/lib/4.7/RcppEigen/include/Eigen/src/Core/DenseCoeffsBase.h:654:74: warning: ignoring attributes on template argument 'Eigen::internal::packet_traits<double>::type' {aka '__m128d'} [-Wignored-attributes]
654 | return internal::first_aligned<int(unpacket_traits<DefaultPacketType>::alignment),Derived>(m);
| ^~~~~~~~~
make[1]: *** [D:/RCompile/recent/R/etc/x64/Makeconf:304: file69598509d6fd.o] Error 1
Backtrace:
▆
1. ├─base::suppressWarnings(...) at test-priors.R:46:3
2. │ └─base::withCallingHandlers(...)
3. └─GMLTM::GMLTM(...)
4. └─rstan::stan_model(stan_file)
5. └─rstan:::cxxfunctionplus(...)
6. ├─pkgbuild::with_build_tools(...)
7. │ └─pkgbuild:::withr_with_path(rtools_path(), code)
8. │ └─base::force(code)
9. └─inline::cxxfunction(...)
10. └─inline:::compileCode(f, code, language = language, verbose = verbose)
── Error ('test-priors.R:46:3'): GMLTM fits successfully with priors$alpha$family = 'lognormal' ──
Error in `sink(type = "output")`: invalid connection
Backtrace:
▆
1. ├─base::suppressWarnings(...) at test-priors.R:46:3
2. │ └─base::withCallingHandlers(...)
3. └─GMLTM::GMLTM(...)
4. └─rstan::stan_model(stan_file)
5. └─rstan:::cxxfunctionplus(...)
6. └─base::sink(type = "output")
[ FAIL 4 | WARN 0 | SKIP 0 | PASS 84 ]
Error:
! Test failures.
Execution halted
Flavor: r-devel-windows-x86_64
Version: 2.0.0
Check: tests
Result: ERROR
Running 'testthat.R' [153s]
Running the tests in 'tests/testthat.R' failed.
Complete output:
> library(testthat)
> library(GMLTM)
> test_check("GMLTM")
specified C++17
make cmd is
make -f "D:/RCompile/recent/R-4.6.1/etc/x64/Makeconf" -f "D:/RCompile/recent/R-4.6.1/share/make/winshlib.mk" CXX='$(CXX17) $(CXX17STD)' CXXFLAGS='$(CXX17FLAGS)' CXXPICFLAGS='$(CXX17PICFLAGS)' SHLIB_LDFLAGS='$(SHLIB_CXX17LDFLAGS)' SHLIB_LD='$(SHLIB_CXX17LD)' SHLIB="file5b7981d313919.dll" WIN=64 TCLBIN= OBJECTS="file5b7981d313919.o"
make would use
make[1]: Entering directory '/d/temp/2026_10_28_01_50_00_27251/RtmpYPAer9'
g++ -std=gnu++17 -I"D:/RCompile/recent/R-4.6.1/include" -DNDEBUG -I"D:/RCompile/CRANpkg/lib/4.6/Rcpp/include/" -I"D:/temp/2026_10_28_01_50_00_27251/RtmpcBcTvo/RLIBS_4fe3c157d5ce/RcppEigen/include/" -I"D:/temp/2026_10_28_01_50_00_27251/RtmpcBcTvo/RLIBS_4fe3c157d5ce/RcppEigen/include/unsupported" -I"D:/temp/2026_10_28_01_50_00_27251/RtmpcBcTvo/RLIBS_4fe3c157d5ce/BH/include" -I"D:/RCompile/CRANpkg/lib/4.6/StanHeaders/include/src/" -I"D:/RCompile/CRANpkg/lib/4.6/StanHeaders/include/" -I"D:/RCompile/CRANpkg/lib/4.6/RcppParallel/include/" -DRCPP_PARALLEL_USE_TBB=1 -DTBB_INTERFACE_NEW -ID:/RCompile/CRANpkg/lib/4.6/RcppParallel/include -I"D:/RCompile/CRANpkg/lib/4.6/rstan/include" -DEIGEN_NO_DEBUG -DBOOST_DISABLE_ASSERTS -DBOOST_PENDING_INTEGER_LOG2_HPP -DSTAN_THREADS -DUSE_STANC3 -DSTRICT_R_HEADERS -DBOOST_PHOENIX_NO_VARIADIC_EXPRESSION -D_HAS_AUTO_PTR_ETC=0 -include "D:/RCompile/CRANpkg/lib/4.6/StanHeaders/include/stan/math/prim/fun/Eigen.hpp" -std=c++1y -I"d:/rtools45/x86_64-w64-mingw32.static.posix/include" -O2 -Wall -mfpmath=sse -msse2 -mstackrealign -c file5b7981d313919.cpp -o file5b7981d313919.o
if test "zfile5b7981d313919.o" != "z"; then \
if test -e "file5b7981d313919-win.def"; then \
echo g++ -shared -s -static-libgcc -o file5b7981d313919.dll file5b7981d313919-win.def file5b7981d313919.o "D:/RCompile/CRANpkg/lib/4.6/rstan/lib/x64/libStanServices.a" -L"D:/RCompile/CRANpkg/lib/4.6/StanHeaders/libs/x64" -lStanHeaders -L"D:/RCompile/CRANpkg/lib/4.6/RcppParallel/lib/x64" -ltbb -LD:/RCompile/CRANpkg/lib/4.6/RcppParallel/libs/x64 -lRcppParallel -LD:/RCompile/CRANpkg/lib/4.6/RcppParallel/lib/x64 -ltbb -ltbbmalloc -L"d:/rtools45/x86_64-w64-mingw32.static.posix/lib/x64" -L"d:/rtools45/x86_64-w64-mingw32.static.posix/lib" -L"D:/RCompile/recent/R-4.6.1/bin/x64" -lR ; \
g++ -shared -s -static-libgcc -o file5b7981d313919.dll file5b7981d313919-win.def file5b7981d313919.o "D:/RCompile/CRANpkg/lib/4.6/rstan/lib/x64/libStanServices.a" -L"D:/RCompile/CRANpkg/lib/4.6/StanHeaders/libs/x64" -lStanHeaders -L"D:/RCompile/CRANpkg/lib/4.6/RcppParallel/lib/x64" -ltbb -LD:/RCompile/CRANpkg/lib/4.6/RcppParallel/libs/x64 -lRcppParallel -LD:/RCompile/CRANpkg/lib/4.6/RcppParallel/lib/x64 -ltbb -ltbbmalloc -L"d:/rtools45/x86_64-w64-mingw32.static.posix/lib/x64" -L"d:/rtools45/x86_64-w64-mingw32.static.posix/lib" -L"D:/RCompile/recent/R-4.6.1/bin/x64" -lR ; \
else \
echo EXPORTS > tmp.def; \
nm file5b7981d313919.o | sed -n 's/^.* [BCDRT] / /p' | sed -e '/[.]refptr[.]/d' -e '/[.]weak[.]/d' | sed 's/[^ ][^ ]*/"&"/g' >> tmp.def; \
echo g++ -shared -s -static-libgcc -o file5b7981d313919.dll tmp.def file5b7981d313919.o "D:/RCompile/CRANpkg/lib/4.6/rstan/lib/x64/libStanServices.a" -L"D:/RCompile/CRANpkg/lib/4.6/StanHeaders/libs/x64" -lStanHeaders -L"D:/RCompile/CRANpkg/lib/4.6/RcppParallel/lib/x64" -ltbb -LD:/RCompile/CRANpkg/lib/4.6/RcppParallel/libs/x64 -lRcppParallel -LD:/RCompile/CRANpkg/lib/4.6/RcppParallel/lib/x64 -ltbb -ltbbmalloc -L"d:/rtools45/x86_64-w64-mingw32.static.posix/lib/x64" -L"d:/rtools45/x86_64-w64-mingw32.static.posix/lib" -L"D:/RCompile/recent/R-4.6.1/bin/x64" -lR ; \
g++ -shared -s -static-libgcc -o file5b7981d313919.dll tmp.def file5b7981d313919.o "D:/RCompile/CRANpkg/lib/4.6/rstan/lib/x64/libStanServices.a" -L"D:/RCompile/CRANpkg/lib/4.6/StanHeaders/libs/x64" -lStanHeaders -L"D:/RCompile/CRANpkg/lib/4.6/RcppParallel/lib/x64" -ltbb -LD:/RCompile/CRANpkg/lib/4.6/RcppParallel/libs/x64 -lRcppParallel -LD:/RCompile/CRANpkg/lib/4.6/RcppParallel/lib/x64 -ltbb -ltbbmalloc -L"d:/rtools45/x86_64-w64-mingw32.static.posix/lib/x64" -L"d:/rtools45/x86_64-w64-mingw32.static.posix/lib" -L"D:/RCompile/recent/R-4.6.1/bin/x64" -lR ; \
rm -f tmp.def; \
fi \
fi
make[1]: Leaving directory '/d/temp/2026_10_28_01_50_00_27251/RtmpYPAer9'
Saving _problems/test-data-input-64.R
specified C++17
make cmd is
make -f "D:/RCompile/recent/R-4.6.1/etc/x64/Makeconf" -f "D:/RCompile/recent/R-4.6.1/share/make/winshlib.mk" CXX='$(CXX17) $(CXX17STD)' CXXFLAGS='$(CXX17FLAGS)' CXXPICFLAGS='$(CXX17PICFLAGS)' SHLIB_LDFLAGS='$(SHLIB_CXX17LDFLAGS)' SHLIB_LD='$(SHLIB_CXX17LD)' SHLIB="file5b7985dd012bd.dll" WIN=64 TCLBIN= OBJECTS="file5b7985dd012bd.o"
make would use
make[1]: Entering directory '/d/temp/2026_10_28_01_50_00_27251/RtmpYPAer9'
g++ -std=gnu++17 -I"D:/RCompile/recent/R-4.6.1/include" -DNDEBUG -I"D:/RCompile/CRANpkg/lib/4.6/Rcpp/include/" -I"D:/temp/2026_10_28_01_50_00_27251/RtmpcBcTvo/RLIBS_4fe3c157d5ce/RcppEigen/include/" -I"D:/temp/2026_10_28_01_50_00_27251/RtmpcBcTvo/RLIBS_4fe3c157d5ce/RcppEigen/include/unsupported" -I"D:/temp/2026_10_28_01_50_00_27251/RtmpcBcTvo/RLIBS_4fe3c157d5ce/BH/include" -I"D:/RCompile/CRANpkg/lib/4.6/StanHeaders/include/src/" -I"D:/RCompile/CRANpkg/lib/4.6/StanHeaders/include/" -I"D:/RCompile/CRANpkg/lib/4.6/RcppParallel/include/" -DRCPP_PARALLEL_USE_TBB=1 -DTBB_INTERFACE_NEW -ID:/RCompile/CRANpkg/lib/4.6/RcppParallel/include -I"D:/RCompile/CRANpkg/lib/4.6/rstan/include" -DEIGEN_NO_DEBUG -DBOOST_DISABLE_ASSERTS -DBOOST_PENDING_INTEGER_LOG2_HPP -DSTAN_THREADS -DUSE_STANC3 -DSTRICT_R_HEADERS -DBOOST_PHOENIX_NO_VARIADIC_EXPRESSION -D_HAS_AUTO_PTR_ETC=0 -include "D:/RCompile/CRANpkg/lib/4.6/StanHeaders/include/stan/math/prim/fun/Eigen.hpp" -std=c++1y -I"d:/rtools45/x86_64-w64-mingw32.static.posix/include" -O2 -Wall -mfpmath=sse -msse2 -mstackrealign -c file5b7985dd012bd.cpp -o file5b7985dd012bd.o
if test "zfile5b7985dd012bd.o" != "z"; then \
if test -e "file5b7985dd012bd-win.def"; then \
echo g++ -shared -s -static-libgcc -o file5b7985dd012bd.dll file5b7985dd012bd-win.def file5b7985dd012bd.o "D:/RCompile/CRANpkg/lib/4.6/rstan/lib/x64/libStanServices.a" -L"D:/RCompile/CRANpkg/lib/4.6/StanHeaders/libs/x64" -lStanHeaders -L"D:/RCompile/CRANpkg/lib/4.6/RcppParallel/lib/x64" -ltbb -LD:/RCompile/CRANpkg/lib/4.6/RcppParallel/libs/x64 -lRcppParallel -LD:/RCompile/CRANpkg/lib/4.6/RcppParallel/lib/x64 -ltbb -ltbbmalloc -L"d:/rtools45/x86_64-w64-mingw32.static.posix/lib/x64" -L"d:/rtools45/x86_64-w64-mingw32.static.posix/lib" -L"D:/RCompile/recent/R-4.6.1/bin/x64" -lR ; \
g++ -shared -s -static-libgcc -o file5b7985dd012bd.dll file5b7985dd012bd-win.def file5b7985dd012bd.o "D:/RCompile/CRANpkg/lib/4.6/rstan/lib/x64/libStanServices.a" -L"D:/RCompile/CRANpkg/lib/4.6/StanHeaders/libs/x64" -lStanHeaders -L"D:/RCompile/CRANpkg/lib/4.6/RcppParallel/lib/x64" -ltbb -LD:/RCompile/CRANpkg/lib/4.6/RcppParallel/libs/x64 -lRcppParallel -LD:/RCompile/CRANpkg/lib/4.6/RcppParallel/lib/x64 -ltbb -ltbbmalloc -L"d:/rtools45/x86_64-w64-mingw32.static.posix/lib/x64" -L"d:/rtools45/x86_64-w64-mingw32.static.posix/lib" -L"D:/RCompile/recent/R-4.6.1/bin/x64" -lR ; \
else \
echo EXPORTS > tmp.def; \
nm file5b7985dd012bd.o | sed -n 's/^.* [BCDRT] / /p' | sed -e '/[.]refptr[.]/d' -e '/[.]weak[.]/d' | sed 's/[^ ][^ ]*/"&"/g' >> tmp.def; \
echo g++ -shared -s -static-libgcc -o file5b7985dd012bd.dll tmp.def file5b7985dd012bd.o "D:/RCompile/CRANpkg/lib/4.6/rstan/lib/x64/libStanServices.a" -L"D:/RCompile/CRANpkg/lib/4.6/StanHeaders/libs/x64" -lStanHeaders -L"D:/RCompile/CRANpkg/lib/4.6/RcppParallel/lib/x64" -ltbb -LD:/RCompile/CRANpkg/lib/4.6/RcppParallel/libs/x64 -lRcppParallel -LD:/RCompile/CRANpkg/lib/4.6/RcppParallel/lib/x64 -ltbb -ltbbmalloc -L"d:/rtools45/x86_64-w64-mingw32.static.posix/lib/x64" -L"d:/rtools45/x86_64-w64-mingw32.static.posix/lib" -L"D:/RCompile/recent/R-4.6.1/bin/x64" -lR ; \
g++ -shared -s -static-libgcc -o file5b7985dd012bd.dll tmp.def file5b7985dd012bd.o "D:/RCompile/CRANpkg/lib/4.6/rstan/lib/x64/libStanServices.a" -L"D:/RCompile/CRANpkg/lib/4.6/StanHeaders/libs/x64" -lStanHeaders -L"D:/RCompile/CRANpkg/lib/4.6/RcppParallel/lib/x64" -ltbb -LD:/RCompile/CRANpkg/lib/4.6/RcppParallel/libs/x64 -lRcppParallel -LD:/RCompile/CRANpkg/lib/4.6/RcppParallel/lib/x64 -ltbb -ltbbmalloc -L"d:/rtools45/x86_64-w64-mingw32.static.posix/lib/x64" -L"d:/rtools45/x86_64-w64-mingw32.static.posix/lib" -L"D:/RCompile/recent/R-4.6.1/bin/x64" -lR ; \
rm -f tmp.def; \
fi \
fi
make[1]: Leaving directory '/d/temp/2026_10_28_01_50_00_27251/RtmpYPAer9'
Saving _problems/test-priors-50.R
[ FAIL 4 | WARN 0 | SKIP 0 | PASS 84 ]
══ Failed tests ════════════════════════════════════════════════════════════════
── Error ('test-data-input.R:60:3'): fitting with a plain matrix runs end to end without error (all four models) ──
Error in `compileCode(f, code, language = language, verbose = verbose)`: del5b79856575427__namespace::model5b79856575427_; BaseRNG = boost::random::additive_combine_engine<boost::random::linear_congruential_engine<unsigned int, 40014, 0, 2147483563>, boost::random::linear_congruential_engine<unsigned int, 40692, 0, 2147483399> >]'
22 | return 0.5 * z.p.transpose() * z.inv_e_metric_ * z.p;
D:/RCompile/CRANpkg/lib/4.6/StanHeaders/include/src/stan/mcmc/hmc/hamiltonians/dense_e_metric.hpp:21:0: required from here
21 | double T(dense_e_point& z) {
D:/RCompile/CRANpkg/lib/4.6/RcppEigen/include/Eigen/src/Core/DenseCoeffsBase.h:654:74: warning: ignoring attributes on template argument 'Eigen::internal::packet_traits<double>::type' {aka '__m128d'} [-Wignored-attributes]
654 | return internal::first_aligned<int(unpacket_traits<DefaultPacketType>::alignment),Derived>(m);
| ^~~~~~~~~
make[1]: *** [D:/RCompile/recent/R-4.6.1/etc/x64/Makeconf:304: file5b7981d313919.o] Error 1
Backtrace:
▆
1. ├─testthat::expect_s3_class(...) at test-data-input.R:60:3
2. │ └─testthat::quasi_label(enquo(object))
3. │ └─rlang::eval_bare(expr, quo_get_env(quo))
4. ├─base::suppressWarnings(...)
5. │ └─base::withCallingHandlers(...)
6. └─GMLTM::GMLTM(...)
7. └─rstan::stan_model(stan_file)
8. └─rstan:::cxxfunctionplus(...)
9. ├─pkgbuild::with_build_tools(...)
10. │ └─pkgbuild:::withr_with_path(rtools_path(), code)
11. │ └─base::force(code)
12. └─inline::cxxfunction(...)
13. └─inline:::compileCode(f, code, language = language, verbose = verbose)
── Error ('test-data-input.R:60:3'): fitting with a plain matrix runs end to end without error (all four models) ──
Error in `sink(type = "output")`: invalid connection
Backtrace:
▆
1. ├─testthat::expect_s3_class(...) at test-data-input.R:60:3
2. │ └─testthat::quasi_label(enquo(object))
3. │ └─rlang::eval_bare(expr, quo_get_env(quo))
4. ├─base::suppressWarnings(...)
5. │ └─base::withCallingHandlers(...)
6. └─GMLTM::GMLTM(...)
7. └─rstan::stan_model(stan_file)
8. └─rstan:::cxxfunctionplus(...)
9. └─base::sink(type = "output")
── Error ('test-priors.R:46:3'): GMLTM fits successfully with priors$alpha$family = 'lognormal' ──
Error in `compileCode(f, code, language = language, verbose = verbose)`: del5b798417637aa__namespace::model5b798417637aa_; BaseRNG = boost::random::additive_combine_engine<boost::random::linear_congruential_engine<unsigned int, 40014, 0, 2147483563>, boost::random::linear_congruential_engine<unsigned int, 40692, 0, 2147483399> >]'
22 | return 0.5 * z.p.transpose() * z.inv_e_metric_ * z.p;
D:/RCompile/CRANpkg/lib/4.6/StanHeaders/include/src/stan/mcmc/hmc/hamiltonians/dense_e_metric.hpp:21:0: required from here
21 | double T(dense_e_point& z) {
D:/RCompile/CRANpkg/lib/4.6/RcppEigen/include/Eigen/src/Core/DenseCoeffsBase.h:654:74: warning: ignoring attributes on template argument 'Eigen::internal::packet_traits<double>::type' {aka '__m128d'} [-Wignored-attributes]
654 | return internal::first_aligned<int(unpacket_traits<DefaultPacketType>::alignment),Derived>(m);
| ^~~~~~~~~
make[1]: *** [D:/RCompile/recent/R-4.6.1/etc/x64/Makeconf:304: file5b7985dd012bd.o] Error 1
Backtrace:
▆
1. ├─base::suppressWarnings(...) at test-priors.R:46:3
2. │ └─base::withCallingHandlers(...)
3. └─GMLTM::GMLTM(...)
4. └─rstan::stan_model(stan_file)
5. └─rstan:::cxxfunctionplus(...)
6. ├─pkgbuild::with_build_tools(...)
7. │ └─pkgbuild:::withr_with_path(rtools_path(), code)
8. │ └─base::force(code)
9. └─inline::cxxfunction(...)
10. └─inline:::compileCode(f, code, language = language, verbose = verbose)
── Error ('test-priors.R:46:3'): GMLTM fits successfully with priors$alpha$family = 'lognormal' ──
Error in `sink(type = "output")`: invalid connection
Backtrace:
▆
1. ├─base::suppressWarnings(...) at test-priors.R:46:3
2. │ └─base::withCallingHandlers(...)
3. └─GMLTM::GMLTM(...)
4. └─rstan::stan_model(stan_file)
5. └─rstan:::cxxfunctionplus(...)
6. └─base::sink(type = "output")
[ FAIL 4 | WARN 0 | SKIP 0 | PASS 84 ]
Error:
! Test failures.
Execution halted
Flavor: r-release-windows-x86_64
Version: 2.0.0
Check: tests
Result: ERROR
Running 'testthat.R' [203s]
Running the tests in 'tests/testthat.R' failed.
Complete output:
> library(testthat)
> library(GMLTM)
> test_check("GMLTM")
make cmd is
make -f "D:/RCompile/recent/R-4.5.3/etc/x64/Makeconf" -f "D:/RCompile/recent/R-4.5.3/share/make/winshlib.mk" CXX='$(CXX17) $(CXX17STD)' CXXFLAGS='$(CXX17FLAGS)' CXXPICFLAGS='$(CXX17PICFLAGS)' SHLIB_LDFLAGS='$(SHLIB_CXX17LDFLAGS)' SHLIB_LD='$(SHLIB_CXX17LD)' SHLIB="filea030234f65c5.dll" WIN=64 TCLBIN= OBJECTS="filea030234f65c5.o"
make would use
make[1]: Entering directory '/d/temp/2026_10_25_22_59_48_19435/RtmpKmDc08'
g++ -std=gnu++17 -I"D:/RCompile/recent/R-4.5.3/include" -DNDEBUG -I"D:/RCompile/CRANpkg/lib/4.5/Rcpp/include/" -I"D:/temp/2026_10_25_22_59_48_19435/Rtmp65BXAT/RLIBS_6272c77282969/RcppEigen/include/" -I"D:/temp/2026_10_25_22_59_48_19435/Rtmp65BXAT/RLIBS_6272c77282969/RcppEigen/include/unsupported" -I"D:/temp/2026_10_25_22_59_48_19435/Rtmp65BXAT/RLIBS_6272c77282969/BH/include" -I"D:/RCompile/CRANpkg/lib/4.5/StanHeaders/include/src/" -I"D:/RCompile/CRANpkg/lib/4.5/StanHeaders/include/" -I"D:/RCompile/CRANpkg/lib/4.5/RcppParallel/include/" -DRCPP_PARALLEL_USE_TBB=1 -DTBB_INTERFACE_NEW -ID:/RCompile/CRANpkg/lib/4.5/RcppParallel/include -I"D:/RCompile/CRANpkg/lib/4.5/rstan/include" -DEIGEN_NO_DEBUG -DBOOST_DISABLE_ASSERTS -DBOOST_PENDING_INTEGER_LOG2_HPP -DSTAN_THREADS -DUSE_STANC3 -DSTRICT_R_HEADERS -DBOOST_PHOENIX_NO_VARIADIC_EXPRESSION -D_HAS_AUTO_PTR_ETC=0 -include "D:/RCompile/CRANpkg/lib/4.5/StanHeaders/include/stan/math/prim/fun/Eigen.hpp" -std=c++1y -I"d:/rtools45/x86_64-w64-mingw32.static.posix/include" -O2 -Wall -mfpmath=sse -msse2 -mstackrealign -c filea030234f65c5.cpp -o filea030234f65c5.o
if test "zfilea030234f65c5.o" != "z"; then \
if test -e "filea030234f65c5-win.def"; then \
echo g++ -shared -s -static-libgcc -o filea030234f65c5.dll filea030234f65c5-win.def filea030234f65c5.o "D:/RCompile/CRANpkg/lib/4.5/rstan/lib/x64/libStanServices.a" -L"D:/RCompile/CRANpkg/lib/4.5/StanHeaders/libs/x64" -lStanHeaders -L"D:/RCompile/CRANpkg/lib/4.5/RcppParallel/lib/x64" -ltbb -LD:/RCompile/CRANpkg/lib/4.5/RcppParallel/libs/x64 -lRcppParallel -LD:/RCompile/CRANpkg/lib/4.5/RcppParallel/lib/x64 -ltbb -ltbbmalloc -L"d:/rtools45/x86_64-w64-mingw32.static.posix/lib/x64" -L"d:/rtools45/x86_64-w64-mingw32.static.posix/lib" -L"D:/RCompile/recent/R-4.5.3/bin/x64" -lR ; \
g++ -shared -s -static-libgcc -o filea030234f65c5.dll filea030234f65c5-win.def filea030234f65c5.o "D:/RCompile/CRANpkg/lib/4.5/rstan/lib/x64/libStanServices.a" -L"D:/RCompile/CRANpkg/lib/4.5/StanHeaders/libs/x64" -lStanHeaders -L"D:/RCompile/CRANpkg/lib/4.5/RcppParallel/lib/x64" -ltbb -LD:/RCompile/CRANpkg/lib/4.5/RcppParallel/libs/x64 -lRcppParallel -LD:/RCompile/CRANpkg/lib/4.5/RcppParallel/lib/x64 -ltbb -ltbbmalloc -L"d:/rtools45/x86_64-w64-mingw32.static.posix/lib/x64" -L"d:/rtools45/x86_64-w64-mingw32.static.posix/lib" -L"D:/RCompile/recent/R-4.5.3/bin/x64" -lR ; \
else \
echo EXPORTS > tmp.def; \
nm filea030234f65c5.o | sed -n 's/^.* [BCDRT] / /p' | sed -e '/[.]refptr[.]/d' -e '/[.]weak[.]/d' | sed 's/[^ ][^ ]*/"&"/g' >> tmp.def; \
echo g++ -shared -s -static-libgcc -o filea030234f65c5.dll tmp.def filea030234f65c5.o "D:/RCompile/CRANpkg/lib/4.5/rstan/lib/x64/libStanServices.a" -L"D:/RCompile/CRANpkg/lib/4.5/StanHeaders/libs/x64" -lStanHeaders -L"D:/RCompile/CRANpkg/lib/4.5/RcppParallel/lib/x64" -ltbb -LD:/RCompile/CRANpkg/lib/4.5/RcppParallel/libs/x64 -lRcppParallel -LD:/RCompile/CRANpkg/lib/4.5/RcppParallel/lib/x64 -ltbb -ltbbmalloc -L"d:/rtools45/x86_64-w64-mingw32.static.posix/lib/x64" -L"d:/rtools45/x86_64-w64-mingw32.static.posix/lib" -L"D:/RCompile/recent/R-4.5.3/bin/x64" -lR ; \
g++ -shared -s -static-libgcc -o filea030234f65c5.dll tmp.def filea030234f65c5.o "D:/RCompile/CRANpkg/lib/4.5/rstan/lib/x64/libStanServices.a" -L"D:/RCompile/CRANpkg/lib/4.5/StanHeaders/libs/x64" -lStanHeaders -L"D:/RCompile/CRANpkg/lib/4.5/RcppParallel/lib/x64" -ltbb -LD:/RCompile/CRANpkg/lib/4.5/RcppParallel/libs/x64 -lRcppParallel -LD:/RCompile/CRANpkg/lib/4.5/RcppParallel/lib/x64 -ltbb -ltbbmalloc -L"d:/rtools45/x86_64-w64-mingw32.static.posix/lib/x64" -L"d:/rtools45/x86_64-w64-mingw32.static.posix/lib" -L"D:/RCompile/recent/R-4.5.3/bin/x64" -lR ; \
rm -f tmp.def; \
fi \
fi
make[1]: Leaving directory '/d/temp/2026_10_25_22_59_48_19435/RtmpKmDc08'
Saving _problems/test-data-input-64.R
make cmd is
make -f "D:/RCompile/recent/R-4.5.3/etc/x64/Makeconf" -f "D:/RCompile/recent/R-4.5.3/share/make/winshlib.mk" CXX='$(CXX17) $(CXX17STD)' CXXFLAGS='$(CXX17FLAGS)' CXXPICFLAGS='$(CXX17PICFLAGS)' SHLIB_LDFLAGS='$(SHLIB_CXX17LDFLAGS)' SHLIB_LD='$(SHLIB_CXX17LD)' SHLIB="filea030245e417f.dll" WIN=64 TCLBIN= OBJECTS="filea030245e417f.o"
make would use
make[1]: Entering directory '/d/temp/2026_10_25_22_59_48_19435/RtmpKmDc08'
g++ -std=gnu++17 -I"D:/RCompile/recent/R-4.5.3/include" -DNDEBUG -I"D:/RCompile/CRANpkg/lib/4.5/Rcpp/include/" -I"D:/temp/2026_10_25_22_59_48_19435/Rtmp65BXAT/RLIBS_6272c77282969/RcppEigen/include/" -I"D:/temp/2026_10_25_22_59_48_19435/Rtmp65BXAT/RLIBS_6272c77282969/RcppEigen/include/unsupported" -I"D:/temp/2026_10_25_22_59_48_19435/Rtmp65BXAT/RLIBS_6272c77282969/BH/include" -I"D:/RCompile/CRANpkg/lib/4.5/StanHeaders/include/src/" -I"D:/RCompile/CRANpkg/lib/4.5/StanHeaders/include/" -I"D:/RCompile/CRANpkg/lib/4.5/RcppParallel/include/" -DRCPP_PARALLEL_USE_TBB=1 -DTBB_INTERFACE_NEW -ID:/RCompile/CRANpkg/lib/4.5/RcppParallel/include -I"D:/RCompile/CRANpkg/lib/4.5/rstan/include" -DEIGEN_NO_DEBUG -DBOOST_DISABLE_ASSERTS -DBOOST_PENDING_INTEGER_LOG2_HPP -DSTAN_THREADS -DUSE_STANC3 -DSTRICT_R_HEADERS -DBOOST_PHOENIX_NO_VARIADIC_EXPRESSION -D_HAS_AUTO_PTR_ETC=0 -include "D:/RCompile/CRANpkg/lib/4.5/StanHeaders/include/stan/math/prim/fun/Eigen.hpp" -std=c++1y -I"d:/rtools45/x86_64-w64-mingw32.static.posix/include" -O2 -Wall -mfpmath=sse -msse2 -mstackrealign -c filea030245e417f.cpp -o filea030245e417f.o
if test "zfilea030245e417f.o" != "z"; then \
if test -e "filea030245e417f-win.def"; then \
echo g++ -shared -s -static-libgcc -o filea030245e417f.dll filea030245e417f-win.def filea030245e417f.o "D:/RCompile/CRANpkg/lib/4.5/rstan/lib/x64/libStanServices.a" -L"D:/RCompile/CRANpkg/lib/4.5/StanHeaders/libs/x64" -lStanHeaders -L"D:/RCompile/CRANpkg/lib/4.5/RcppParallel/lib/x64" -ltbb -LD:/RCompile/CRANpkg/lib/4.5/RcppParallel/libs/x64 -lRcppParallel -LD:/RCompile/CRANpkg/lib/4.5/RcppParallel/lib/x64 -ltbb -ltbbmalloc -L"d:/rtools45/x86_64-w64-mingw32.static.posix/lib/x64" -L"d:/rtools45/x86_64-w64-mingw32.static.posix/lib" -L"D:/RCompile/recent/R-4.5.3/bin/x64" -lR ; \
g++ -shared -s -static-libgcc -o filea030245e417f.dll filea030245e417f-win.def filea030245e417f.o "D:/RCompile/CRANpkg/lib/4.5/rstan/lib/x64/libStanServices.a" -L"D:/RCompile/CRANpkg/lib/4.5/StanHeaders/libs/x64" -lStanHeaders -L"D:/RCompile/CRANpkg/lib/4.5/RcppParallel/lib/x64" -ltbb -LD:/RCompile/CRANpkg/lib/4.5/RcppParallel/libs/x64 -lRcppParallel -LD:/RCompile/CRANpkg/lib/4.5/RcppParallel/lib/x64 -ltbb -ltbbmalloc -L"d:/rtools45/x86_64-w64-mingw32.static.posix/lib/x64" -L"d:/rtools45/x86_64-w64-mingw32.static.posix/lib" -L"D:/RCompile/recent/R-4.5.3/bin/x64" -lR ; \
else \
echo EXPORTS > tmp.def; \
nm filea030245e417f.o | sed -n 's/^.* [BCDRT] / /p' | sed -e '/[.]refptr[.]/d' -e '/[.]weak[.]/d' | sed 's/[^ ][^ ]*/"&"/g' >> tmp.def; \
echo g++ -shared -s -static-libgcc -o filea030245e417f.dll tmp.def filea030245e417f.o "D:/RCompile/CRANpkg/lib/4.5/rstan/lib/x64/libStanServices.a" -L"D:/RCompile/CRANpkg/lib/4.5/StanHeaders/libs/x64" -lStanHeaders -L"D:/RCompile/CRANpkg/lib/4.5/RcppParallel/lib/x64" -ltbb -LD:/RCompile/CRANpkg/lib/4.5/RcppParallel/libs/x64 -lRcppParallel -LD:/RCompile/CRANpkg/lib/4.5/RcppParallel/lib/x64 -ltbb -ltbbmalloc -L"d:/rtools45/x86_64-w64-mingw32.static.posix/lib/x64" -L"d:/rtools45/x86_64-w64-mingw32.static.posix/lib" -L"D:/RCompile/recent/R-4.5.3/bin/x64" -lR ; \
g++ -shared -s -static-libgcc -o filea030245e417f.dll tmp.def filea030245e417f.o "D:/RCompile/CRANpkg/lib/4.5/rstan/lib/x64/libStanServices.a" -L"D:/RCompile/CRANpkg/lib/4.5/StanHeaders/libs/x64" -lStanHeaders -L"D:/RCompile/CRANpkg/lib/4.5/RcppParallel/lib/x64" -ltbb -LD:/RCompile/CRANpkg/lib/4.5/RcppParallel/libs/x64 -lRcppParallel -LD:/RCompile/CRANpkg/lib/4.5/RcppParallel/lib/x64 -ltbb -ltbbmalloc -L"d:/rtools45/x86_64-w64-mingw32.static.posix/lib/x64" -L"d:/rtools45/x86_64-w64-mingw32.static.posix/lib" -L"D:/RCompile/recent/R-4.5.3/bin/x64" -lR ; \
rm -f tmp.def; \
fi \
fi
make[1]: Leaving directory '/d/temp/2026_10_25_22_59_48_19435/RtmpKmDc08'
Saving _problems/test-priors-50.R
[ FAIL 4 | WARN 0 | SKIP 0 | PASS 84 ]
══ Failed tests ════════════════════════════════════════════════════════════════
── Error ('test-data-input.R:60:3'): fitting with a plain matrix runs end to end without error (all four models) ──
Error in `compileCode(f, code, language = language, verbose = verbose)`: modela0302f701a44__namespace::modela0302f701a44_; BaseRNG = boost::random::additive_combine_engine<boost::random::linear_congruential_engine<unsigned int, 40014, 0, 2147483563>, boost::random::linear_congruential_engine<unsigned int, 40692, 0, 2147483399> >]'
22 | return 0.5 * z.p.transpose() * z.inv_e_metric_ * z.p;
D:/RCompile/CRANpkg/lib/4.5/StanHeaders/include/src/stan/mcmc/hmc/hamiltonians/dense_e_metric.hpp:21:0: required from here
21 | double T(dense_e_point& z) {
D:/RCompile/CRANpkg/lib/4.5/RcppEigen/include/Eigen/src/Core/DenseCoeffsBase.h:654:74: warning: ignoring attributes on template argument 'Eigen::internal::packet_traits<double>::type' {aka '__m128d'} [-Wignored-attributes]
654 | return internal::first_aligned<int(unpacket_traits<DefaultPacketType>::alignment),Derived>(m);
| ^~~~~~~~~
make[1]: *** [D:/RCompile/recent/R-4.5.3/etc/x64/Makeconf:302: filea030234f65c5.o] Error 1
Backtrace:
▆
1. ├─testthat::expect_s3_class(...) at test-data-input.R:60:3
2. │ └─testthat::quasi_label(enquo(object))
3. │ └─rlang::eval_bare(expr, quo_get_env(quo))
4. ├─base::suppressWarnings(...)
5. │ └─base::withCallingHandlers(...)
6. └─GMLTM::GMLTM(...)
7. └─rstan::stan_model(stan_file)
8. └─rstan:::cxxfunctionplus(...)
9. ├─pkgbuild::with_build_tools(...)
10. │ └─pkgbuild:::withr_with_path(rtools_path(), code)
11. │ └─base::force(code)
12. └─inline::cxxfunction(...)
13. └─inline:::compileCode(f, code, language = language, verbose = verbose)
── Error ('test-data-input.R:60:3'): fitting with a plain matrix runs end to end without error (all four models) ──
Error in `sink(type = "output")`: invalid connection
Backtrace:
▆
1. ├─testthat::expect_s3_class(...) at test-data-input.R:60:3
2. │ └─testthat::quasi_label(enquo(object))
3. │ └─rlang::eval_bare(expr, quo_get_env(quo))
4. ├─base::suppressWarnings(...)
5. │ └─base::withCallingHandlers(...)
6. └─GMLTM::GMLTM(...)
7. └─rstan::stan_model(stan_file)
8. └─rstan:::cxxfunctionplus(...)
9. └─base::sink(type = "output")
── Error ('test-priors.R:46:3'): GMLTM fits successfully with priors$alpha$family = 'lognormal' ──
Error in `compileCode(f, code, language = language, verbose = verbose)`: modela030624d7c70__namespace::modela030624d7c70_; BaseRNG = boost::random::additive_combine_engine<boost::random::linear_congruential_engine<unsigned int, 40014, 0, 2147483563>, boost::random::linear_congruential_engine<unsigned int, 40692, 0, 2147483399> >]'
22 | return 0.5 * z.p.transpose() * z.inv_e_metric_ * z.p;
D:/RCompile/CRANpkg/lib/4.5/StanHeaders/include/src/stan/mcmc/hmc/hamiltonians/dense_e_metric.hpp:21:0: required from here
21 | double T(dense_e_point& z) {
D:/RCompile/CRANpkg/lib/4.5/RcppEigen/include/Eigen/src/Core/DenseCoeffsBase.h:654:74: warning: ignoring attributes on template argument 'Eigen::internal::packet_traits<double>::type' {aka '__m128d'} [-Wignored-attributes]
654 | return internal::first_aligned<int(unpacket_traits<DefaultPacketType>::alignment),Derived>(m);
| ^~~~~~~~~
make[1]: *** [D:/RCompile/recent/R-4.5.3/etc/x64/Makeconf:302: filea030245e417f.o] Error 1
Backtrace:
▆
1. ├─base::suppressWarnings(...) at test-priors.R:46:3
2. │ └─base::withCallingHandlers(...)
3. └─GMLTM::GMLTM(...)
4. └─rstan::stan_model(stan_file)
5. └─rstan:::cxxfunctionplus(...)
6. ├─pkgbuild::with_build_tools(...)
7. │ └─pkgbuild:::withr_with_path(rtools_path(), code)
8. │ └─base::force(code)
9. └─inline::cxxfunction(...)
10. └─inline:::compileCode(f, code, language = language, verbose = verbose)
── Error ('test-priors.R:46:3'): GMLTM fits successfully with priors$alpha$family = 'lognormal' ──
Error in `sink(type = "output")`: invalid connection
Backtrace:
▆
1. ├─base::suppressWarnings(...) at test-priors.R:46:3
2. │ └─base::withCallingHandlers(...)
3. └─GMLTM::GMLTM(...)
4. └─rstan::stan_model(stan_file)
5. └─rstan:::cxxfunctionplus(...)
6. └─base::sink(type = "output")
[ FAIL 4 | WARN 0 | SKIP 0 | PASS 84 ]
Error:
! Test failures.
Execution halted
Flavor: r-oldrel-windows-x86_64